S.N,Initial_admission,duration_of_ICU_stay,Age,Sex,Hypertension,Diabetes_mellitus,COPD,Stroke,Cardiovascular_diseases,Renal_disease,Malignancy,Hypothyroidism,Psychotic_disorder,Seizure_disorder,Polytrauma,Parkinsonism,Dyslipidemia,Duration_symptomonset_to_admission,shortness_of_breath,Fever,headache,Fatigue,Cough,vomiting,Myalgia,Diarrhoea,sore_throat_or_throat_irritation,chest_pain,Abdominal_pain,anorexia,anosmia,aguesia,Respiratory_rate,Pulse_rate,Spo2inroomair,TLC,Neutophils,Lymphocytes,CRP,LDH,Ferritin,D_dimer,CT_score,Hypoxemic_respiratory_failure,Hypercapnic_respiratory_failure,ARDS,Arrythmia,AKI,Sepsis_or_septic_shock,Development_of_first_complication_after_onset_of_symptoms,Mechanical_Ventilation,Onset_of_symptoms_to_Mechanical_ventilation,CPAP,BiPAP,Endotracheal_Intubation,DurationCPAP,DurationBiPAP,DurationEndotrachealintubation,Total_duration_of_mechanical_ventilation,Total_duration_of_hospital_stay,Vaccination_status,mild,moderate,severe,critical,In_hospital_mortality,Severity_at_admission
25.0,1.0,4.0,63.0,2.0,2.0,2.0,1.0,2.0,2.0,2.0,2.0,2.0,2.0,2.0,2.0,2.0,2.0,5.0,1.0,1.0,1.0,2.0,2.0,2.0,2.0,2.0,2.0,2.0,2.0,2.0,2.0,2.0,28.0,96.0,68.0,4570.0,45.3,42.5,1.0,396.0,495.6,0.58,,1.0,2.0,2.0,2.0,2.0,2.0,7.0,1.0,7.0,1.0,2.0,2.0,4.0,,,4.0,6.0,,0.0,0.0,1.0,0.0,1.0,1.0
15.0,1.0,7.0,53.0,2.0,2.0,2.0,2.0,2.0,2.0,2.0,2.0,2.0,2.0,2.0,2.0,2.0,2.0,4.0,1.0,1.0,2.0,2.0,1.0,2.0,2.0,2.0,2.0,2.0,2.0,2.0,2.0,2.0,22.0,98.0,86.0,4650.0,62.8,31.2,1.0,620.0,1687.4,,,1.0,2.0,2.0,2.0,2.0,2.0,9.0,1.0,9.0,1.0,2.0,2.0,7.0,,,7.0,12.0,0.0,0.0,0.0,1.0,0.0,1.0,1.0
77.0,1.0,,62.0,1.0,2.0,2.0,2.0,2.0,2.0,2.0,2.0,2.0,2.0,2.0,2.0,2.0,2.0,7.0,1.0,2.0,2.0,2.0,2.0,2.0,2.0,2.0,2.0,2.0,1.0,2.0,2.0,2.0,20.0,82.0,91.0,3900.0,67.0,27.0,,,,,,2.0,2.0,2.0,2.0,2.0,2.0,,2.0,,2.0,2.0,2.0,,,,,2.0,0.0,0.0,1.0,0.0,0.0,1.0,0.0
12.0,1.0,1.0,64.0,1.0,1.0,1.0,2.0,2.0,2.0,2.0,2.0,2.0,2.0,2.0,2.0,2.0,2.0,10.0,1.0,1.0,2.0,2.0,2.0,2.0,2.0,1.0,2.0,2.0,1.0,2.0,2.0,2.0,22.0,78.0,70.0,8300.0,78.0,45.0,,,,,,2.0,2.0,1.0,2.0,2.0,2.0,10.0,2.0,,2.0,2.0,2.0,,,,,2.0,0.0,0.0,0.0,1.0,0.0,1.0,1.0
23.0,1.0,,73.0,1.0,1.0,2.0,1.0,2.0,2.0,2.0,2.0,2.0,2.0,2.0,2.0,2.0,2.0,4.0,1.0,2.0,2.0,2.0,1.0,2.0,2.0,2.0,2.0,2.0,2.0,2.0,2.0,2.0,22.0,98.0,85.0,5200.0,80.0,17.0,1.0,450.0,721.0,,,2.0,2.0,1.0,2.0,2.0,2.0,7.0,2.0,,2.0,2.0,2.0,,,,,6.0,0.0,0.0,0.0,1.0,0.0,1.0,1.0
42.0,1.0,,81.0,1.0,1.0,1.0,2.0,2.0,2.0,1.0,2.0,2.0,2.0,2.0,2.0,2.0,2.0,4.0,1.0,1.0,2.0,2.0,2.0,2.0,1.0,2.0,2.0,2.0,2.0,1.0,2.0,2.0,22.0,98.0,92.0,12800.0,89.0,4.0,1.0,497.0,556.6,10.0,,2.0,2.0,2.0,2.0,2.0,2.0,4.0,2.0,,2.0,2.0,2.0,,,,,1.0,0.0,0.0,1.0,0.0,0.0,1.0,0.0
38.0,1.0,7.0,68.0,1.0,2.0,1.0,2.0,2.0,2.0,1.0,2.0,2.0,2.0,2.0,2.0,2.0,2.0,1.0,1.0,2.0,2.0,2.0,1.0,2.0,2.0,2.0,2.0,1.0,2.0,2.0,2.0,2.0,24.0,94.0,84.0,,,,1.0,868.0,2119.0,7.61,,1.0,2.0,2.0,2.0,2.0,2.0,8.0,1.0,8.0,1.0,2.0,2.0,7.0,,,7.0,14.0,1.0,0.0,0.0,1.0,0.0,1.0,1.0
2.0,1.0,1.0,45.0,2.0,2.0,2.0,2.0,2.0,2.0,2.0,2.0,2.0,2.0,2.0,2.0,2.0,2.0,5.0,1.0,2.0,1.0,2.0,1.0,2.0,2.0,2.0,2.0,2.0,2.0,2.0,2.0,2.0,24.0,98.0,80.0,13100.0,85.0,13.0,1.0,502.0,310.8,5.08,19.0,1.0,2.0,2.0,2.0,2.0,2.0,14.0,1.0,14.0,1.0,2.0,2.0,5.0,,,5.0,14.0,1.0,0.0,0.0,1.0,0.0,1.0,1.0
17.0,2.0,,53.0,2.0,2.0,2.0,2.0,2.0,2.0,2.0,2.0,2.0,2.0,2.0,2.0,2.0,2.0,5.0,1.0,1.0,2.0,2.0,2.0,2.0,2.0,2.0,2.0,2.0,2.0,2.0,2.0,2.0,27.0,109.0,70.0,,,,1.0,318.0,491.1,0.96,,1.0,2.0,2.0,2.0,2.0,2.0,11.0,1.0,11.0,1.0,2.0,2.0,4.0,,,4.0,10.0,,0.0,0.0,1.0,0.0,1.0,1.0
18.0,2.0,,59.0,2.0,1.0,2.0,1.0,2.0,2.0,2.0,2.0,1.0,2.0,2.0,2.0,2.0,2.0,5.0,1.0,2.0,2.0,2.0,1.0,2.0,2.0,2.0,2.0,2.0,2.0,2.0,2.0,2.0,22.0,96.0,68.0,5900.0,63.0,32.0,,,,,23.0,1.0,2.0,2.0,2.0,2.0,2.0,9.0,1.0,9.0,1.0,2.0,2.0,4.0,,,4.0,8.0,,0.0,0.0,1.0,0.0,1.0,1.0
24.0,2.0,,65.0,1.0,1.0,2.0,2.0,2.0,1.0,2.0,2.0,2.0,2.0,2.0,2.0,2.0,2.0,3.0,2.0,1.0,2.0,2.0,2.0,2.0,1.0,2.0,2.0,2.0,2.0,1.0,2.0,2.0,22.0,98.0,88.0,,,,,,,,,1.0,2.0,2.0,2.0,2.0,2.0,12.0,1.0,11.0,1.0,2.0,2.0,2.0,,,2.0,11.0,,0.0,0.0,1.0,0.0,1.0,1.0
35.0,2.0,,71.0,1.0,2.0,1.0,2.0,2.0,2.0,2.0,2.0,1.0,2.0,2.0,2.0,2.0,2.0,5.0,1.0,1.0,2.0,2.0,1.0,2.0,2.0,1.0,2.0,2.0,2.0,2.0,2.0,2.0,26.0,84.0,78.0,10910.0,94.7,2.1,1.0,576.0,447.2,1.2,,2.0,2.0,1.0,2.0,2.0,2.0,5.0,1.0,6.0,1.0,1.0,1.0,1.0,1.0,2.0,4.0,5.0,,0.0,0.0,0.0,1.0,1.0,1.0
16.0,2.0,14.0,61.0,1.0,2.0,2.0,2.0,2.0,2.0,2.0,2.0,2.0,2.0,2.0,2.0,2.0,2.0,13.0,2.0,1.0,2.0,2.0,1.0,1.0,2.0,2.0,2.0,1.0,2.0,2.0,2.0,2.0,20.0,86.0,91.0,5680.0,93.0,5.1,1.0,,1824.0,1.03,23.0,1.0,2.0,2.0,2.0,2.0,2.0,16.0,1.0,16.0,1.0,2.0,2.0,14.0,,,14.0,17.0,,0.0,1.0,0.0,0.0,1.0,0.0
23.0,2.0,8.0,57.0,1.0,2.0,2.0,2.0,2.0,2.0,2.0,2.0,2.0,2.0,2.0,2.0,2.0,2.0,3.0,2.0,1.0,2.0,2.0,1.0,2.0,2.0,2.0,2.0,2.0,2.0,2.0,2.0,2.0,22.0,100.0,90.0,,,,1.0,1051.0,1137.9,,14.0,1.0,2.0,1.0,2.0,2.0,2.0,7.0,1.0,7.0,1.0,2.0,1.0,3.0,,4.0,7.0,11.0,,0.0,1.0,0.0,0.0,1.0,0.0
4.0,2.0,,67.0,2.0,1.0,2.0,2.0,2.0,2.0,2.0,2.0,2.0,2.0,2.0,2.0,2.0,2.0,7.0,1.0,2.0,2.0,2.0,1.0,1.0,2.0,1.0,2.0,2.0,2.0,1.0,2.0,2.0,42.0,168.0,33.0,,,,,,,,,2.0,2.0,1.0,2.0,2.0,2.0,10.0,2.0,,2.0,2.0,2.0,,,,,3.0,,0.0,0.0,0.0,1.0,1.0,1.0
9.0,2.0,,87.0,1.0,1.0,2.0,2.0,2.0,2.0,2.0,2.0,2.0,2.0,2.0,2.0,2.0,2.0,4.0,1.0,1.0,2.0,2.0,1.0,2.0,2.0,2.0,2.0,2.0,2.0,2.0,2.0,2.0,22.0,72.0,84.0,10800.0,79.0,14.0,1.0,,603.3,2.93,,2.0,2.0,2.0,2.0,2.0,2.0,10.0,2.0,,2.0,2.0,2.0,,,,,8.0,,0.0,0.0,1.0,0.0,1.0,1.0
16.0,2.0,,68.0,2.0,2.0,2.0,2.0,2.0,2.0,2.0,2.0,2.0,2.0,2.0,2.0,2.0,2.0,5.0,1.0,2.0,2.0,2.0,2.0,2.0,2.0,2.0,2.0,2.0,2.0,2.0,2.0,2.0,22.0,84.0,85.0,5000.0,88.6,7.6,1.0,347.0,560.4,0.25,,1.0,2.0,2.0,2.0,2.0,2.0,5.0,1.0,5.0,1.0,2.0,2.0,4.0,,,4.0,4.0,,0.0,0.0,1.0,0.0,1.0,1.0
14.0,2.0,,60.0,1.0,1.0,1.0,2.0,2.0,2.0,2.0,2.0,2.0,2.0,2.0,2.0,2.0,2.0,5.0,1.0,1.0,2.0,2.0,2.0,2.0,2.0,2.0,2.0,1.0,2.0,2.0,2.0,2.0,24.0,91.0,84.0,,,,,,,,,1.0,2.0,2.0,2.0,2.0,2.0,5.0,1.0,5.0,1.0,2.0,2.0,5.0,,,5.0,5.0,0.0,0.0,0.0,1.0,0.0,1.0,1.0
19.0,2.0,,33.0,2.0,2.0,2.0,2.0,2.0,2.0,2.0,2.0,2.0,2.0,2.0,2.0,2.0,2.0,3.0,1.0,1.0,2.0,2.0,2.0,2.0,2.0,2.0,2.0,2.0,2.0,2.0,2.0,2.0,28.0,90.0,70.0,19000.0,92.0,3.3,,,,,19.0,2.0,1.0,2.0,2.0,2.0,2.0,13.0,1.0,3.0,2.0,1.0,2.0,,10.0,,10.0,11.0,0.0,0.0,0.0,1.0,0.0,1.0,1.0
28.0,2.0,,82.0,1.0,1.0,2.0,1.0,2.0,2.0,2.0,2.0,2.0,2.0,2.0,2.0,2.0,2.0,5.0,1.0,1.0,2.0,2.0,2.0,2.0,1.0,2.0,2.0,2.0,2.0,1.0,2.0,2.0,26.0,98.0,63.0,,,,,,,,,2.0,2.0,1.0,2.0,2.0,2.0,8.0,2.0,,2.0,2.0,2.0,,,,,4.0,0.0,0.0,0.0,1.0,0.0,1.0,1.0
35.0,2.0,10.0,65.0,2.0,1.0,2.0,2.0,2.0,2.0,2.0,2.0,2.0,2.0,2.0,2.0,2.0,2.0,7.0,1.0,1.0,2.0,2.0,1.0,2.0,2.0,2.0,2.0,2.0,2.0,2.0,2.0,2.0,22.0,87.0,42.0,26400.0,86.0,10.0,1.0,517.0,706.9,,,1.0,1.0,2.0,2.0,2.0,2.0,7.0,1.0,7.0,1.0,1.0,2.0,19.0,4.0,,23.0,23.0,0.0,0.0,0.0,1.0,0.0,1.0,1.0
39.0,2.0,4.0,49.0,1.0,2.0,2.0,2.0,2.0,2.0,2.0,2.0,2.0,2.0,2.0,2.0,2.0,2.0,3.0,1.0,1.0,2.0,2.0,1.0,2.0,2.0,2.0,2.0,2.0,2.0,2.0,2.0,2.0,22.0,102.0,62.0,3660.0,79.8,12.6,1.0,715.0,2183.7,,,1.0,2.0,1.0,2.0,2.0,2.0,5.0,1.0,5.0,1.0,2.0,1.0,2.0,,1.0,3.0,5.0,0.0,0.0,0.0,1.0,0.0,1.0,1.0
3.0,2.0,,84.0,2.0,2.0,2.0,2.0,2.0,2.0,2.0,2.0,2.0,2.0,2.0,2.0,2.0,2.0,3.0,2.0,2.0,2.0,2.0,2.0,2.0,1.0,1.0,2.0,2.0,2.0,2.0,2.0,2.0,24.0,106.0,85.0,8500.0,84.0,14.0,,,,,,2.0,2.0,1.0,2.0,1.0,2.0,8.0,2.0,,2.0,2.0,2.0,,,,,4.0,0.0,0.0,0.0,1.0,0.0,1.0,1.0
5.0,2.0,,86.0,1.0,2.0,2.0,2.0,2.0,2.0,2.0,2.0,2.0,2.0,2.0,2.0,2.0,2.0,9.0,1.0,1.0,2.0,2.0,1.0,2.0,2.0,2.0,2.0,2.0,2.0,2.0,2.0,2.0,30.0,88.0,78.0,11310.0,94.0,1.9,1.0,,2158.9,1.86,15.0,1.0,2.0,1.0,2.0,2.0,2.0,9.0,1.0,9.0,1.0,2.0,2.0,1.0,,,1.0,1.0,0.0,0.0,0.0,1.0,0.0,1.0,1.0
6.0,2.0,,91.0,1.0,2.0,2.0,2.0,2.0,2.0,2.0,2.0,2.0,2.0,2.0,2.0,2.0,2.0,3.0,2.0,1.0,2.0,2.0,1.0,2.0,2.0,2.0,2.0,2.0,2.0,2.0,2.0,2.0,32.0,98.0,70.0,11100.0,85.0,10.0,1.0,,,,,2.0,2.0,2.0,2.0,2.0,2.0,3.0,2.0,,2.0,2.0,2.0,,,,,1.0,0.0,0.0,0.0,1.0,0.0,1.0,1.0
8.0,2.0,,76.0,2.0,2.0,2.0,2.0,2.0,2.0,2.0,2.0,2.0,2.0,2.0,2.0,2.0,2.0,10.0,1.0,2.0,2.0,2.0,1.0,2.0,2.0,2.0,2.0,2.0,2.0,2.0,2.0,2.0,24.0,92.0,70.0,,,,,,,,,2.0,2.0,1.0,2.0,2.0,2.0,10.0,2.0,,2.0,2.0,2.0,,,,,1.0,0.0,0.0,0.0,1.0,0.0,1.0,1.0
10.0,2.0,,54.0,1.0,2.0,2.0,2.0,2.0,2.0,2.0,2.0,2.0,2.0,2.0,2.0,2.0,2.0,4.0,2.0,1.0,2.0,2.0,1.0,2.0,1.0,2.0,2.0,2.0,2.0,2.0,2.0,2.0,26.0,86.0,89.0,8560.0,92.4,5.8,1.0,536.0,2427.5,0.25,,2.0,2.0,1.0,2.0,1.0,2.0,7.0,2.0,,2.0,2.0,2.0,,,,,8.0,0.0,0.0,0.0,1.0,0.0,1.0,1.0
11.0,2.0,,91.0,1.0,2.0,2.0,2.0,2.0,2.0,2.0,2.0,2.0,2.0,2.0,2.0,2.0,2.0,5.0,2.0,1.0,2.0,2.0,1.0,2.0,2.0,2.0,2.0,2.0,2.0,2.0,2.0,2.0,24.0,78.0,84.0,,,,,,,,,2.0,2.0,2.0,2.0,2.0,2.0,9.0,2.0,,2.0,2.0,2.0,,,,,8.0,0.0,0.0,0.0,1.0,0.0,1.0,1.0
22.0,2.0,,75.0,1.0,1.0,2.0,2.0,2.0,2.0,2.0,2.0,1.0,2.0,2.0,2.0,2.0,2.0,3.0,1.0,1.0,2.0,2.0,1.0,2.0,1.0,2.0,2.0,2.0,2.0,1.0,2.0,2.0,28.0,100.0,84.0,11600.0,90.0,8.0,,,,,,2.0,2.0,1.0,2.0,2.0,2.0,8.0,2.0,,2.0,2.0,2.0,,,,,6.0,0.0,0.0,0.0,1.0,0.0,1.0,1.0
29.0,2.0,,60.0,1.0,2.0,2.0,2.0,2.0,2.0,2.0,2.0,2.0,2.0,2.0,2.0,2.0,2.0,7.0,1.0,1.0,2.0,2.0,1.0,2.0,1.0,1.0,2.0,1.0,2.0,1.0,2.0,2.0,28.0,102.0,84.0,5400.0,85.0,13.0,,,,,,2.0,2.0,1.0,2.0,2.0,2.0,7.0,2.0,,2.0,2.0,2.0,,,,,1.0,0.0,0.0,0.0,1.0,0.0,1.0,1.0
31.0,2.0,,62.0,2.0,2.0,2.0,2.0,2.0,2.0,2.0,2.0,2.0,2.0,2.0,2.0,2.0,2.0,3.0,1.0,2.0,2.0,2.0,1.0,2.0,2.0,2.0,2.0,2.0,2.0,2.0,2.0,2.0,24.0,96.0,80.0,8760.0,84.1,9.8,,,,,,2.0,2.0,1.0,2.0,2.0,2.0,15.0,2.0,,2.0,2.0,2.0,,,,,20.0,0.0,0.0,0.0,1.0,0.0,1.0,1.0
33.0,2.0,,60.0,2.0,2.0,1.0,2.0,2.0,2.0,2.0,2.0,2.0,2.0,2.0,2.0,2.0,2.0,5.0,1.0,2.0,2.0,2.0,2.0,2.0,2.0,2.0,2.0,2.0,2.0,2.0,2.0,2.0,24.0,112.0,80.0,,,,,,,,,2.0,2.0,1.0,2.0,2.0,2.0,5.0,2.0,,2.0,2.0,2.0,,,,,1.0,0.0,0.0,0.0,0.0,1.0,1.0,1.0
34.0,2.0,,75.0,1.0,1.0,2.0,2.0,2.0,2.0,2.0,2.0,2.0,2.0,2.0,2.0,2.0,2.0,5.0,1.0,2.0,2.0,2.0,1.0,2.0,2.0,2.0,2.0,2.0,2.0,2.0,2.0,2.0,38.0,116.0,47.0,9080.0,88.0,0.5,1.0,990.0,1394.0,2.98,,2.0,2.0,1.0,2.0,2.0,2.0,10.0,2.0,,2.0,2.0,2.0,,,,,5.0,0.0,0.0,0.0,0.0,1.0,1.0,1.0
39.0,2.0,,61.0,2.0,2.0,2.0,1.0,2.0,2.0,2.0,2.0,2.0,2.0,2.0,2.0,2.0,2.0,2.0,1.0,2.0,2.0,2.0,2.0,2.0,2.0,2.0,2.0,2.0,2.0,2.0,2.0,2.0,24.0,76.0,82.0,,,,2.0,,40.6,,,2.0,2.0,1.0,2.0,2.0,2.0,5.0,2.0,,2.0,2.0,2.0,,,,,3.0,0.0,0.0,0.0,1.0,0.0,1.0,1.0
38.0,2.0,,74.0,1.0,1.0,1.0,2.0,1.0,2.0,2.0,2.0,2.0,2.0,2.0,2.0,2.0,2.0,5.0,2.0,1.0,2.0,2.0,1.0,2.0,1.0,2.0,2.0,2.0,2.0,2.0,2.0,2.0,33.0,115.0,70.0,9900.0,81.0,18.0,,,,1.17,,1.0,2.0,2.0,2.0,2.0,2.0,9.0,1.0,9.0,1.0,2.0,2.0,2.0,,,2.0,5.0,0.0,0.0,0.0,1.0,0.0,1.0,1.0
39.0,2.0,,82.0,1.0,2.0,2.0,2.0,1.0,2.0,2.0,2.0,2.0,2.0,2.0,2.0,2.0,2.0,1.0,1.0,2.0,2.0,2.0,1.0,2.0,2.0,2.0,2.0,2.0,2.0,2.0,2.0,2.0,20.0,96.0,94.0,12680.0,88.6,6.9,,,,,,2.0,2.0,1.0,2.0,2.0,2.0,12.0,2.0,,2.0,2.0,2.0,,,,,12.0,0.0,0.0,1.0,0.0,0.0,1.0,0.0
3.0,2.0,10.0,76.0,1.0,2.0,2.0,1.0,2.0,2.0,2.0,2.0,2.0,2.0,1.0,2.0,2.0,2.0,1.0,1.0,1.0,2.0,2.0,1.0,2.0,2.0,2.0,2.0,2.0,2.0,2.0,2.0,2.0,20.0,76.0,84.0,6100.0,80.0,17.0,,463.0,1805.0,2.95,,1.0,2.0,1.0,2.0,2.0,2.0,1.0,1.0,1.0,1.0,2.0,1.0,8.0,,9.0,17.0,18.0,0.0,0.0,0.0,1.0,0.0,1.0,1.0
6.0,2.0,14.0,48.0,1.0,1.0,2.0,2.0,2.0,2.0,2.0,2.0,2.0,2.0,2.0,2.0,2.0,2.0,2.0,1.0,1.0,2.0,2.0,2.0,2.0,2.0,2.0,2.0,2.0,2.0,2.0,2.0,2.0,22.0,110.0,85.0,8800.0,88.0,0.0,1.0,906.0,2140.0,,20.0,1.0,2.0,2.0,2.0,2.0,2.0,7.0,1.0,7.0,1.0,2.0,2.0,14.0,,,14.0,17.0,0.0,0.0,0.0,1.0,0.0,1.0,1.0
20.0,2.0,,86.0,2.0,1.0,1.0,2.0,2.0,2.0,2.0,2.0,2.0,2.0,2.0,2.0,2.0,2.0,7.0,1.0,1.0,2.0,2.0,1.0,2.0,2.0,2.0,2.0,2.0,2.0,2.0,2.0,2.0,22.0,88.0,87.0,5200.0,73.0,23.0,,,,,,1.0,2.0,2.0,2.0,2.0,2.0,9.0,1.0,10.0,1.0,2.0,2.0,4.0,,,4.0,7.0,1.0,0.0,0.0,1.0,0.0,1.0,1.0
36.0,2.0,,74.0,1.0,2.0,2.0,1.0,2.0,2.0,2.0,2.0,2.0,2.0,2.0,2.0,2.0,2.0,7.0,1.0,1.0,2.0,2.0,1.0,2.0,2.0,2.0,2.0,2.0,2.0,2.0,2.0,2.0,22.0,112.0,89.0,7200.0,89.0,10.0,,,,,,2.0,2.0,1.0,2.0,2.0,2.0,14.0,2.0,,2.0,2.0,2.0,,,,,8.0,1.0,0.0,0.0,1.0,0.0,1.0,1.0
43.0,2.0,,49.0,1.0,1.0,2.0,2.0,2.0,1.0,2.0,2.0,2.0,2.0,2.0,2.0,2.0,2.0,14.0,1.0,1.0,2.0,2.0,1.0,2.0,2.0,2.0,2.0,2.0,2.0,2.0,2.0,2.0,26.0,92.0,89.0,10590.0,90.6,5.9,1.0,381.0,618.0,1.2,,1.0,2.0,1.0,2.0,2.0,2.0,19.0,1.0,18.0,1.0,2.0,2.0,2.0,,,2.0,6.0,1.0,0.0,0.0,1.0,0.0,1.0,1.0
47.0,2.0,,65.0,1.0,2.0,1.0,2.0,2.0,2.0,2.0,2.0,2.0,2.0,2.0,2.0,2.0,2.0,5.0,1.0,2.0,2.0,2.0,2.0,2.0,1.0,2.0,2.0,2.0,2.0,2.0,2.0,2.0,32.0,110.0,68.0,10200.0,90.0,6.0,,,,,,1.0,2.0,2.0,2.0,2.0,2.0,5.0,1.0,8.0,1.0,2.0,2.0,6.0,,,6.0,9.0,1.0,0.0,0.0,1.0,0.0,1.0,1.0
1.0,2.0,,86.0,1.0,1.0,1.0,2.0,2.0,2.0,2.0,2.0,2.0,2.0,2.0,2.0,2.0,2.0,10.0,1.0,1.0,2.0,2.0,2.0,2.0,2.0,2.0,2.0,2.0,2.0,2.0,2.0,2.0,24.0,128.0,82.0,,,,1.0,448.0,275.3,0.25,,2.0,2.0,1.0,2.0,1.0,1.0,10.0,2.0,,2.0,2.0,2.0,,,,,7.0,1.0,0.0,0.0,1.0,0.0,1.0,1.0
30.0,2.0,,83.0,2.0,2.0,2.0,2.0,2.0,2.0,2.0,2.0,2.0,2.0,2.0,2.0,2.0,2.0,1.0,1.0,1.0,2.0,2.0,2.0,2.0,1.0,2.0,2.0,2.0,2.0,1.0,2.0,2.0,34.0,104.0,40.0,10300.0,90.0,7.0,,,,,,2.0,2.0,1.0,2.0,2.0,2.0,1.0,2.0,,2.0,2.0,2.0,,,,,2.0,1.0,0.0,0.0,0.0,1.0,1.0,1.0
32.0,2.0,,82.0,1.0,2.0,2.0,2.0,2.0,2.0,2.0,2.0,2.0,2.0,2.0,2.0,2.0,2.0,2.0,1.0,1.0,2.0,1.0,2.0,2.0,2.0,2.0,2.0,2.0,2.0,2.0,2.0,2.0,32.0,114.0,62.0,4400.0,85.0,13.0,1.0,814.0,1273.3,,,2.0,2.0,1.0,2.0,2.0,2.0,2.0,2.0,,2.0,2.0,2.0,,,,,3.0,1.0,0.0,0.0,0.0,1.0,1.0,1.0
44.0,2.0,,89.0,1.0,2.0,2.0,2.0,2.0,2.0,2.0,2.0,2.0,2.0,2.0,2.0,2.0,2.0,1.0,1.0,1.0,2.0,2.0,1.0,2.0,2.0,2.0,2.0,2.0,2.0,2.0,2.0,2.0,26.0,82.0,50.0,6300.0,89.0,8.0,,,,,,2.0,2.0,1.0,2.0,2.0,2.0,12.0,2.0,,2.0,2.0,2.0,,,,,1.0,1.0,0.0,0.0,0.0,1.0,1.0,1.0
1.0,2.0,,73.0,1.0,2.0,2.0,2.0,2.0,2.0,2.0,2.0,2.0,2.0,2.0,2.0,2.0,2.0,5.0,1.0,1.0,2.0,1.0,2.0,2.0,1.0,2.0,2.0,2.0,2.0,2.0,2.0,2.0,26.0,66.0,91.0,3200.0,69.0,30.0,1.0,546.0,1604.5,,,2.0,2.0,1.0,2.0,1.0,2.0,5.0,2.0,,2.0,2.0,2.0,,,,,2.0,1.0,0.0,1.0,0.0,0.0,1.0,0.0
3.0,2.0,1.0,87.0,1.0,1.0,2.0,2.0,2.0,2.0,2.0,2.0,2.0,2.0,2.0,2.0,2.0,2.0,1.0,2.0,1.0,2.0,2.0,2.0,2.0,2.0,1.0,2.0,2.0,2.0,2.0,2.0,2.0,26.0,98.0,92.0,11000.0,92.0,6.0,1.0,229.0,1346.0,,,2.0,2.0,1.0,2.0,2.0,2.0,22.0,2.0,,2.0,2.0,2.0,,,,,22.0,1.0,0.0,1.0,0.0,0.0,1.0,0.0
27.0,3.0,5.0,77.0,2.0,2.0,2.0,2.0,2.0,2.0,2.0,2.0,2.0,2.0,2.0,2.0,2.0,2.0,7.0,1.0,1.0,2.0,2.0,2.0,2.0,1.0,1.0,2.0,2.0,2.0,2.0,2.0,2.0,32.0,124.0,51.0,7580.0,89.3,5.8,1.0,432.0,1193.2,,,1.0,2.0,2.0,2.0,2.0,1.0,7.0,1.0,7.0,1.0,2.0,2.0,5.0,,,5.0,5.0,,0.0,0.0,0.0,1.0,1.0,1.0
5.0,3.0,8.0,54.0,1.0,1.0,2.0,2.0,2.0,2.0,2.0,2.0,1.0,2.0,2.0,2.0,2.0,2.0,3.0,1.0,1.0,2.0,2.0,1.0,2.0,2.0,2.0,2.0,2.0,2.0,2.0,2.0,2.0,22.0,92.0,60.0,4200.0,81.0,,1.0,832.0,2323.6,0.01,24.0,1.0,1.0,2.0,2.0,2.0,2.0,3.0,1.0,3.0,1.0,1.0,2.0,7.5,0.5,,8.0,8.0,,0.0,0.0,1.0,0.0,1.0,1.0
17.0,3.0,12.0,63.0,2.0,1.0,1.0,2.0,2.0,2.0,2.0,2.0,2.0,2.0,2.0,2.0,2.0,2.0,2.0,2.0,1.0,2.0,2.0,1.0,2.0,2.0,2.0,2.0,2.0,2.0,2.0,2.0,2.0,22.0,88.0,87.0,,,,2.0,580.0,806.4,,,1.0,1.0,2.0,2.0,2.0,2.0,5.0,1.0,5.0,1.0,1.0,2.0,4.5,2.0,,6.5,12.0,,0.0,0.0,1.0,0.0,1.0,1.0
43.0,3.0,7.0,62.0,2.0,1.0,2.0,2.0,2.0,2.0,2.0,2.0,2.0,2.0,2.0,2.0,2.0,2.0,4.0,1.0,2.0,2.0,1.0,2.0,2.0,2.0,2.0,2.0,2.0,2.0,2.0,2.0,2.0,20.0,90.0,83.0,20000.0,90.0,6.0,1.0,441.0,858.6,,19.0,1.0,2.0,2.0,2.0,2.0,2.0,8.0,1.0,8.0,1.0,2.0,2.0,3.0,,,3.0,7.0,,0.0,0.0,1.0,0.0,1.0,1.0
45.0,3.0,6.0,65.0,2.0,2.0,1.0,1.0,2.0,2.0,2.0,2.0,2.0,2.0,2.0,2.0,2.0,2.0,5.0,2.0,2.0,2.0,2.0,2.0,2.0,2.0,2.0,1.0,2.0,2.0,2.0,2.0,2.0,28.0,95.0,68.0,4570.0,45.3,42.5,1.0,396.0,495.6,0.58,,1.0,2.0,2.0,2.0,2.0,2.0,8.0,1.0,8.0,1.0,2.0,2.0,2.5,,,2.5,6.0,,0.0,0.0,1.0,0.0,1.0,1.0
2.0,3.0,6.0,74.0,2.0,2.0,2.0,1.0,2.0,2.0,2.0,2.0,2.0,2.0,2.0,2.0,2.0,2.0,5.0,1.0,2.0,2.0,2.0,2.0,2.0,2.0,2.0,2.0,2.0,2.0,2.0,2.0,2.0,26.0,110.0,73.0,8520.0,88.7,6.0,1.0,,,,,2.0,2.0,1.0,2.0,2.0,2.0,10.0,2.0,,2.0,2.0,2.0,,,,,6.0,,0.0,0.0,1.0,0.0,1.0,1.0
45.0,3.0,8.0,66.0,1.0,2.0,2.0,2.0,2.0,1.0,2.0,2.0,2.0,2.0,2.0,2.0,2.0,2.0,10.0,2.0,2.0,2.0,1.0,2.0,2.0,2.0,2.0,2.0,2.0,2.0,1.0,2.0,2.0,22.0,116.0,88.0,9300.0,66.0,32.0,1.0,550.0,1398.9,1.21,,1.0,2.0,2.0,2.0,2.0,2.0,1.0,2.0,,2.0,2.0,2.0,,,,,8.0,,0.0,0.0,1.0,0.0,1.0,1.0
13.0,3.0,13.0,45.0,2.0,2.0,2.0,2.0,2.0,2.0,2.0,2.0,2.0,2.0,2.0,2.0,2.0,2.0,8.0,1.0,2.0,2.0,2.0,1.0,2.0,2.0,2.0,2.0,2.0,2.0,2.0,2.0,2.0,20.0,98.0,74.0,13100.0,85.0,13.0,,502.0,310.8,,19.0,1.0,2.0,2.0,2.0,2.0,2.0,18.0,1.0,18.0,1.0,2.0,2.0,3.0,,,3.0,13.0,,0.0,0.0,1.0,0.0,1.0,1.0
9.0,3.0,9.0,24.0,1.0,2.0,2.0,2.0,2.0,2.0,2.0,2.0,2.0,2.0,2.0,1.0,2.0,2.0,,2.0,2.0,2.0,2.0,2.0,2.0,2.0,2.0,2.0,2.0,2.0,2.0,2.0,2.0,24.0,120.0,55.0,13860.0,84.4,10.0,1.0,420.0,347.1,3700.0,,1.0,2.0,1.0,2.0,2.0,2.0,,1.0,,1.0,2.0,1.0,4.0,,5.0,9.0,9.0,,0.0,0.0,1.0,0.0,1.0,1.0
10.0,3.0,7.0,87.0,2.0,2.0,2.0,2.0,2.0,2.0,2.0,2.0,2.0,2.0,2.0,2.0,2.0,2.0,7.0,1.0,1.0,2.0,2.0,2.0,2.0,2.0,2.0,2.0,2.0,2.0,2.0,2.0,2.0,22.0,81.0,82.0,4800.0,84.0,13.0,,,,,,1.0,1.0,2.0,2.0,2.0,2.0,10.0,1.0,10.0,1.0,1.0,2.0,3.5,0.5,,4.0,7.0,,0.0,0.0,1.0,0.0,1.0,1.0
33.0,3.0,6.0,74.0,1.0,1.0,2.0,2.0,1.0,2.0,2.0,2.0,2.0,2.0,2.0,2.0,2.0,2.0,4.0,2.0,2.0,2.0,2.0,2.0,2.0,2.0,2.0,2.0,2.0,2.0,1.0,2.0,2.0,22.0,115.0,70.0,11900.0,81.0,18.0,2.0,,,1.17,,1.0,2.0,2.0,2.0,2.0,2.0,4.0,1.0,4.0,1.0,2.0,2.0,2.0,,,2.0,6.0,,0.0,0.0,1.0,0.0,1.0,1.0
41.0,3.0,7.0,62.0,1.0,1.0,2.0,2.0,2.0,2.0,2.0,2.0,2.0,2.0,2.0,2.0,2.0,2.0,7.0,1.0,2.0,2.0,2.0,1.0,2.0,2.0,2.0,2.0,1.0,2.0,2.0,2.0,2.0,22.0,88.0,90.0,3100.0,80.0,18.0,1.0,1353.0,1670.1,,,1.0,2.0,2.0,2.0,2.0,2.0,11.0,1.0,11.0,1.0,2.0,2.0,3.0,,,3.0,7.0,,0.0,1.0,0.0,0.0,1.0,0.0
46.0,3.0,3.0,59.0,2.0,1.0,2.0,2.0,2.0,2.0,2.0,2.0,1.0,2.0,2.0,2.0,2.0,2.0,3.0,2.0,1.0,2.0,2.0,1.0,2.0,2.0,2.0,2.0,1.0,2.0,2.0,2.0,2.0,22.0,86.0,89.0,3800.0,74.0,23.0,1.0,5564.0,737.5,0.77,24.0,1.0,2.0,2.0,2.0,2.0,2.0,5.0,1.0,5.0,1.0,2.0,2.0,2.0,,,2.0,3.0,,0.0,0.0,1.0,0.0,1.0,1.0
7.0,3.0,8.0,65.0,1.0,2.0,2.0,1.0,2.0,2.0,2.0,2.0,2.0,2.0,2.0,2.0,2.0,2.0,5.0,2.0,1.0,2.0,2.0,1.0,2.0,2.0,2.0,2.0,2.0,2.0,2.0,2.0,2.0,44.0,100.0,71.0,,,,1.0,1285.0,2375.5,1.47,,2.0,2.0,1.0,2.0,2.0,1.0,5.0,2.0,,2.0,2.0,2.0,,,,,8.0,0.0,0.0,0.0,1.0,0.0,1.0,1.0
13.0,3.0,10.0,82.0,2.0,2.0,2.0,2.0,2.0,2.0,2.0,2.0,1.0,2.0,2.0,2.0,2.0,2.0,7.0,1.0,1.0,2.0,2.0,1.0,2.0,2.0,2.0,2.0,2.0,2.0,2.0,2.0,2.0,24.0,82.0,88.0,11460.0,95.0,3.0,1.0,963.0,1362.7,8.18,,1.0,2.0,2.0,2.0,2.0,2.0,11.0,1.0,11.0,1.0,2.0,2.0,6.0,,,6.0,10.0,0.0,0.0,0.0,1.0,0.0,1.0,1.0
41.0,3.0,3.0,49.0,1.0,2.0,2.0,2.0,2.0,2.0,2.0,2.0,2.0,2.0,2.0,2.0,2.0,2.0,4.0,1.0,1.0,2.0,2.0,1.0,2.0,2.0,2.0,2.0,2.0,2.0,2.0,2.0,2.0,30.0,82.0,32.0,9700.0,91.0,6.0,1.0,571.0,2232.0,,23.0,1.0,2.0,2.0,2.0,1.0,2.0,4.0,1.0,4.0,1.0,2.0,2.0,3.0,,,3.0,3.0,0.0,0.0,0.0,0.0,1.0,1.0,1.0
4.0,3.0,6.0,45.0,1.0,2.0,2.0,2.0,2.0,2.0,2.0,2.0,2.0,2.0,2.0,2.0,2.0,2.0,8.0,1.0,1.0,2.0,2.0,2.0,2.0,2.0,2.0,2.0,2.0,2.0,2.0,2.0,2.0,28.0,70.0,65.0,11400.0,89.0,16.0,1.0,1033.0,1300.0,,,1.0,2.0,2.0,2.0,2.0,2.0,11.0,1.0,11.0,1.0,2.0,2.0,3.0,,,3.0,6.0,0.0,0.0,0.0,1.0,0.0,1.0,1.0
15.0,3.0,11.0,43.0,1.0,2.0,2.0,2.0,2.0,2.0,2.0,2.0,2.0,2.0,2.0,2.0,2.0,2.0,3.0,1.0,1.0,1.0,2.0,2.0,1.0,2.0,2.0,2.0,2.0,2.0,2.0,2.0,2.0,22.0,88.0,87.0,4000.0,80.0,18.0,,,,,,1.0,1.0,2.0,2.0,2.0,2.0,11.0,1.0,11.0,1.0,1.0,2.0,1.0,2.0,,3.0,11.0,0.0,0.0,0.0,1.0,0.0,1.0,1.0
18.0,3.0,5.0,49.0,1.0,2.0,2.0,2.0,2.0,2.0,2.0,2.0,2.0,2.0,2.0,2.0,2.0,2.0,4.0,1.0,1.0,2.0,2.0,1.0,2.0,2.0,2.0,2.0,2.0,2.0,2.0,2.0,2.0,28.0,82.0,32.0,9700.0,91.0,6.0,1.0,571.0,2232.0,,23.0,1.0,2.0,2.0,2.0,1.0,2.0,4.0,1.0,4.0,1.0,2.0,2.0,4.5,,,4.5,5.0,0.0,0.0,0.0,1.0,0.0,1.0,1.0
21.0,3.0,12.0,46.0,1.0,2.0,2.0,2.0,2.0,2.0,2.0,2.0,2.0,2.0,2.0,2.0,2.0,2.0,5.0,2.0,1.0,1.0,2.0,2.0,2.0,1.0,2.0,2.0,2.0,2.0,2.0,2.0,2.0,20.0,72.0,86.0,3500.0,60.0,36.0,1.0,788.0,1677.5,0.25,16.0,1.0,2.0,1.0,2.0,2.0,2.0,7.0,1.0,7.0,1.0,2.0,1.0,1.0,,5.0,6.0,12.0,0.0,0.0,0.0,1.0,0.0,1.0,1.0
25.0,3.0,26.0,64.0,1.0,2.0,2.0,2.0,2.0,2.0,2.0,2.0,2.0,2.0,2.0,2.0,2.0,2.0,3.0,2.0,1.0,2.0,2.0,2.0,2.0,2.0,2.0,1.0,2.0,2.0,2.0,2.0,2.0,22.0,112.0,89.0,3600.0,79.0,18.0,1.0,,1844.0,2.36,,1.0,2.0,2.0,2.0,2.0,2.0,9.0,1.0,9.0,1.0,2.0,2.0,20.0,,,20.0,26.0,0.0,0.0,0.0,1.0,0.0,1.0,1.0
30.0,3.0,28.0,65.0,1.0,2.0,2.0,2.0,2.0,2.0,2.0,2.0,2.0,2.0,2.0,2.0,2.0,2.0,1.0,1.0,2.0,2.0,2.0,2.0,2.0,2.0,2.0,2.0,2.0,2.0,2.0,2.0,2.0,30.0,88.0,75.0,8960.0,74.4,18.4,1.0,486.0,1350.0,0.48,,1.0,2.0,2.0,2.0,2.0,2.0,11.0,1.0,11.0,1.0,2.0,2.0,18.0,,,18.0,28.0,0.0,0.0,0.0,1.0,0.0,1.0,1.0
34.0,3.0,15.0,71.0,2.0,2.0,2.0,1.0,2.0,2.0,2.0,2.0,2.0,2.0,2.0,2.0,2.0,2.0,2.0,1.0,1.0,2.0,2.0,1.0,2.0,2.0,2.0,2.0,2.0,2.0,1.0,2.0,2.0,22.0,76.0,86.0,4900.0,92.0,5.0,,,,,,2.0,2.0,2.0,2.0,2.0,2.0,,2.0,,2.0,2.0,2.0,,,,,15.0,0.0,0.0,0.0,1.0,0.0,1.0,1.0
40.0,3.0,10.0,54.0,1.0,2.0,2.0,2.0,2.0,2.0,2.0,2.0,2.0,2.0,2.0,2.0,2.0,2.0,3.0,2.0,1.0,2.0,2.0,1.0,2.0,2.0,2.0,2.0,2.0,2.0,2.0,2.0,2.0,18.0,76.0,82.0,6700.0,87.0,9.0,1.0,1208.0,852.6,16.0,,1.0,1.0,2.0,2.0,2.0,2.0,7.0,1.0,7.0,1.0,1.0,2.0,3.0,1.0,,4.0,10.0,0.0,0.0,0.0,1.0,0.0,1.0,1.0
42.0,3.0,2.0,79.0,1.0,2.0,2.0,1.0,2.0,1.0,2.0,2.0,2.0,2.0,2.0,2.0,2.0,2.0,7.0,1.0,1.0,2.0,2.0,1.0,2.0,2.0,2.0,2.0,2.0,2.0,2.0,2.0,2.0,28.0,124.0,65.0,19000.0,80.0,14.0,2.0,,,,,2.0,2.0,2.0,2.0,1.0,2.0,7.0,2.0,,2.0,2.0,2.0,,,,,2.0,0.0,0.0,0.0,1.0,0.0,1.0,1.0
37.0,3.0,1.0,57.0,2.0,2.0,1.0,2.0,2.0,2.0,2.0,2.0,2.0,2.0,2.0,2.0,2.0,2.0,9.0,1.0,1.0,2.0,1.0,2.0,2.0,1.0,2.0,2.0,2.0,2.0,2.0,2.0,2.0,34.0,122.0,72.0,8240.0,63.4,29.6,1.0,903.0,2011.7,,,1.0,2.0,2.0,2.0,2.0,2.0,9.0,1.0,9.0,1.0,2.0,2.0,1.0,,,1.0,1.0,0.0,0.0,0.0,0.0,1.0,1.0,1.0
40.0,3.0,1.0,72.0,1.0,2.0,2.0,2.0,2.0,2.0,2.0,2.0,2.0,2.0,2.0,2.0,2.0,2.0,6.0,1.0,2.0,2.0,2.0,2.0,2.0,2.0,2.0,2.0,2.0,2.0,2.0,2.0,2.0,32.0,98.0,46.0,,,,1.0,906.0,1173.0,0.8,,1.0,2.0,2.0,2.0,2.0,1.0,6.0,1.0,6.0,1.0,2.0,2.0,1.0,,,1.0,1.0,0.0,0.0,0.0,0.0,1.0,1.0,1.0
1.0,3.0,9.0,58.0,2.0,2.0,2.0,2.0,2.0,2.0,2.0,2.0,2.0,1.0,2.0,2.0,2.0,2.0,2.0,1.0,1.0,2.0,2.0,1.0,2.0,2.0,2.0,2.0,2.0,2.0,2.0,2.0,2.0,30.0,117.0,45.0,13350.0,70.0,25.0,1.0,769.0,372.0,0.1,,1.0,2.0,1.0,2.0,2.0,2.0,4.0,1.0,4.0,1.0,2.0,1.0,4.5,,3.5,8.0,9.0,0.0,0.0,0.0,1.0,0.0,1.0,1.0
7.0,3.0,13.0,70.0,1.0,2.0,2.0,2.0,2.0,2.0,2.0,2.0,2.0,2.0,2.0,2.0,2.0,2.0,7.0,2.0,1.0,2.0,2.0,1.0,2.0,2.0,2.0,2.0,2.0,2.0,2.0,2.0,2.0,28.0,98.0,40.0,8100.0,86.0,10.0,,,,,,1.0,2.0,2.0,2.0,2.0,2.0,8.0,1.0,8.0,1.0,2.0,2.0,9.5,,,9.5,13.0,0.0,0.0,0.0,1.0,0.0,1.0,1.0
19.0,3.0,10.0,60.0,1.0,1.0,2.0,2.0,2.0,2.0,2.0,2.0,2.0,2.0,2.0,2.0,2.0,2.0,11.0,2.0,1.0,2.0,2.0,1.0,2.0,1.0,2.0,2.0,2.0,2.0,2.0,2.0,2.0,20.0,86.0,87.0,6800.0,78.0,20.0,1.0,1295.0,1119.0,,,1.0,2.0,2.0,2.0,2.0,2.0,14.0,1.0,14.0,1.0,2.0,2.0,6.0,,,6.0,10.0,0.0,0.0,0.0,1.0,0.0,1.0,1.0
24.0,3.0,17.0,76.0,1.0,1.0,2.0,2.0,2.0,2.0,2.0,2.0,1.0,2.0,2.0,2.0,2.0,2.0,8.0,1.0,1.0,2.0,2.0,1.0,2.0,2.0,2.0,2.0,2.0,2.0,2.0,2.0,2.0,24.0,90.0,65.0,9200.0,83.4,8.5,1.0,1241.0,2465.9,,,1.0,2.0,2.0,2.0,2.0,2.0,11.0,1.0,11.0,1.0,2.0,2.0,15.0,,,15.0,17.0,0.0,0.0,0.0,1.0,0.0,1.0,1.0
38.0,3.0,8.0,74.0,1.0,2.0,1.0,1.0,2.0,2.0,2.0,2.0,2.0,2.0,2.0,2.0,2.0,2.0,,2.0,2.0,2.0,2.0,2.0,2.0,2.0,2.0,2.0,2.0,2.0,2.0,2.0,2.0,20.0,93.0,91.0,11190.0,91.2,2.2,,,,,4.0,2.0,1.0,2.0,2.0,2.0,2.0,,1.0,,2.0,1.0,2.0,,2.0,,2.0,8.0,0.0,0.0,1.0,0.0,0.0,1.0,0.0
46.0,3.0,8.0,78.0,2.0,1.0,1.0,2.0,2.0,2.0,2.0,2.0,2.0,2.0,2.0,2.0,2.0,2.0,5.0,2.0,1.0,2.0,2.0,1.0,2.0,2.0,2.0,2.0,2.0,2.0,2.0,2.0,2.0,22.0,102.0,85.0,,,,,,,,18.0,1.0,2.0,2.0,2.0,2.0,2.0,10.0,1.0,7.0,1.0,2.0,2.0,6.0,,,6.0,8.0,1.0,0.0,0.0,1.0,0.0,1.0,1.0
2.0,3.0,8.0,65.0,1.0,2.0,2.0,2.0,2.0,2.0,2.0,2.0,2.0,2.0,2.0,2.0,2.0,2.0,5.0,1.0,2.0,2.0,1.0,2.0,2.0,1.0,2.0,2.0,2.0,2.0,2.0,2.0,2.0,26.0,88.0,61.0,10200.0,90.0,6.0,,,,,,2.0,2.0,1.0,2.0,2.0,2.0,13.0,1.0,6.0,1.0,1.0,2.0,3.0,4.0,,7.0,9.0,1.0,0.0,0.0,1.0,0.0,1.0,1.0
32.0,3.0,8.0,54.0,1.0,2.0,2.0,2.0,2.0,2.0,2.0,2.0,2.0,2.0,2.0,2.0,2.0,2.0,3.0,1.0,1.0,2.0,2.0,1.0,2.0,1.0,2.0,2.0,1.0,2.0,2.0,2.0,2.0,22.0,64.0,77.0,11100.0,87.0,10.0,1.0,440.0,1384.4,,,1.0,2.0,2.0,2.0,2.0,2.0,5.0,1.0,5.0,1.0,2.0,2.0,5.0,,,5.0,8.0,1.0,0.0,0.0,1.0,0.0,1.0,1.0
20.0,3.0,2.0,92.0,1.0,2.0,2.0,2.0,2.0,2.0,1.0,2.0,2.0,2.0,2.0,2.0,2.0,2.0,3.0,1.0,1.0,2.0,2.0,1.0,2.0,2.0,2.0,2.0,2.0,2.0,2.0,2.0,2.0,28.0,89.0,68.0,6300.0,89.0,8.0,,,,,,2.0,2.0,2.0,2.0,2.0,2.0,,2.0,,2.0,2.0,2.0,,,,,2.0,1.0,0.0,0.0,1.0,0.0,1.0,1.0
47.0,1.0,,72.0,2.0,2.0,1.0,1.0,2.0,2.0,2.0,2.0,2.0,2.0,2.0,2.0,2.0,1.0,7.0,1.0,1.0,2.0,2.0,2.0,2.0,2.0,2.0,2.0,2.0,2.0,2.0,2.0,2.0,24.0,90.0,67.0,7200.0,88.0,8.0,2.0,827.0,1848.3,1.61,,2.0,2.0,2.0,2.0,2.0,2.0,,2.0,,2.0,2.0,2.0,,,,,14.0,,0.0,0.0,1.0,0.0,0.0,1.0
52.0,1.0,,54.0,2.0,1.0,1.0,2.0,2.0,2.0,2.0,2.0,2.0,2.0,2.0,2.0,2.0,2.0,10.0,2.0,1.0,2.0,2.0,1.0,2.0,2.0,2.0,2.0,2.0,2.0,2.0,2.0,2.0,22.0,82.0,85.0,7000.0,81.0,17.0,2.0,400.0,780.0,,,2.0,2.0,2.0,2.0,2.0,2.0,,2.0,,2.0,2.0,2.0,,,,,11.0,,0.0,0.0,1.0,0.0,0.0,1.0
112.0,1.0,,65.0,1.0,2.0,2.0,2.0,2.0,2.0,2.0,2.0,2.0,2.0,1.0,2.0,2.0,2.0,4.0,2.0,2.0,2.0,2.0,2.0,2.0,1.0,2.0,2.0,2.0,2.0,2.0,2.0,2.0,20.0,78.0,92.0,,,,,,,,11.0,2.0,2.0,2.0,2.0,2.0,2.0,,2.0,,2.0,2.0,2.0,,,,,11.0,,0.0,1.0,0.0,0.0,0.0,0.0